Can't build svn10729

This section is now closed.

Audacity 1.3.x is now obsolete. Please use the current Audacity 2.0.x package for your distribution or compile Audacity from the source code.

Can't build svn10729

Permanent link to this post Posted by ka1ssr » Wed Oct 13, 2010 4:15 am

I've been having trouble building 1.3.12 for a couple of weeks. Configure and make clean run fine, but make yields the following after a while...

Code: Select all
[lots of build messages]

libtool: compile:  gcc -c -I./include -I./src/common -I./src/os/unix -g -O2 -DPA_LITTLE_ENDIAN -pthread -DPACKAGE_NAME=\"\" -DPACKAGE_TARNAME=\"\" -DPACKAGE_VERSION=\"\" -DPACKAGE_STRING=\"\" -DPACKAGE_BUGREPORT=\"\" -DPACKAGE_URL=\"\" -DSTDC_HEADERS=1 -DHAVE_SYS_TYPES_H=1 -DHAVE_SYS_STAT_H=1 -DHAVE_STDLIB_H=1 -DHAVE_STRING_H=1 -DHAVE_MEMORY_H=1 -DHAVE_STRINGS_H=1 -DHAVE_INTTYPES_H=1 -DHAVE_STDINT_H=1 -DHAVE_UNISTD_H=1 -DHAVE_DLFCN_H=1 -DLT_OBJDIR=\".libs/\" -DHAVE_SYS_SOUNDCARD_H=1 -DHAVE_LINUX_SOUNDCARD_H=1 -DSIZEOF_SHORT=2 -DSIZEOF_INT=4 -DSIZEOF_LONG=4 -DHAVE_CLOCK_GETTIME=1 -DHAVE_NANOSLEEP=1 -DPA_USE_ALSA=1 -DPA_USE_JACK=1 -DPA_USE_OSS=1 src/os/unix/pa_unix_util.c -o src/os/unix/pa_unix_util.o >/dev/null 2>&1
/bin/sh ./libtool --mode=link gcc  -rpath /usr/local/lib -no-undefined -export-symbols-regex "(Pa|PaMacCore|PaJack|PaAlsa|PaAsio)_.*" -version-info 2:0:0 -o lib/libportaudio.la src/common/pa_allocation.lo src/common/pa_converters.lo src/common/pa_cpuload.lo src/common/pa_dither.lo src/common/pa_debugprint.lo src/common/pa_front.lo src/common/pa_process.lo src/common/pa_skeleton.lo src/common/pa_stream.lo src/common/pa_trace.lo src/hostapi/alsa/pa_linux_alsa.lo src/hostapi/jack/pa_jack.lo src/common/pa_ringbuffer.lo src/hostapi/oss/pa_unix_oss.lo src/os/unix/pa_unix_hostapis.lo src/os/unix/pa_unix_util.lo -lrt -lasound -ljack -lpthread -lrt   -lm -lpthread
eval: 1: libtool_args+=: not found
eval: 1: libtool_args+=: not found
eval: 1: libtool_args+=: not found
eval: 1: libtool_args+=: not found
eval: 1: libtool_args+=: not found
eval: 1: libtool_args+=: not found
eval: 1: libtool_args+=: not found
eval: 1: libtool_args+=: not found
eval: 1: compile_command+=: not found
eval: 1: finalize_command+=: not found
eval: 1: libtool_args+=: not found
eval: 1: compile_command+=: not found
eval: 1: finalize_command+=: not found
eval: 1: libtool_args+=: not found
eval: 1: libobjs+=: not found
eval: 1: non_pic_objects+=: not found
eval: 1: compile_command+=: not found
eval: 1: finalize_command+=: not found
eval: 1: libtool_args+=: not found
eval: 1: libobjs+=: not found
eval: 1: non_pic_objects+=: not found
eval: 1: compile_command+=: not found
eval: 1: finalize_command+=: not found
eval: 1: libtool_args+=: not found
eval: 1: libobjs+=: not found
eval: 1: non_pic_objects+=: not found
eval: 1: compile_command+=: not found
eval: 1: finalize_command+=: not found
eval: 1: libtool_args+=: not found
eval: 1: libobjs+=: not found
eval: 1: non_pic_objects+=: not found
eval: 1: compile_command+=: not found
eval: 1: finalize_command+=: not found
eval: 1: libtool_args+=: not found
eval: 1: libobjs+=: not found
eval: 1: non_pic_objects+=: not found
eval: 1: compile_command+=: not found
eval: 1: finalize_command+=: not found
eval: 1: libtool_args+=: not found
eval: 1: libobjs+=: not found
eval: 1: non_pic_objects+=: not found
eval: 1: compile_command+=: not found
eval: 1: finalize_command+=: not found
eval: 1: libtool_args+=: not found
eval: 1: libobjs+=: not found
eval: 1: non_pic_objects+=: not found
eval: 1: compile_command+=: not found
eval: 1: finalize_command+=: not found
eval: 1: libtool_args+=: not found
eval: 1: libobjs+=: not found
eval: 1: non_pic_objects+=: not found
eval: 1: compile_command+=: not found
eval: 1: finalize_command+=: not found
eval: 1: libtool_args+=: not found
eval: 1: libobjs+=: not found
eval: 1: non_pic_objects+=: not found
eval: 1: compile_command+=: not found
eval: 1: finalize_command+=: not found
eval: 1: libtool_args+=: not found
eval: 1: libobjs+=: not found
eval: 1: non_pic_objects+=: not found
eval: 1: compile_command+=: not found
eval: 1: finalize_command+=: not found
eval: 1: libtool_args+=: not found
eval: 1: libobjs+=: not found
eval: 1: non_pic_objects+=: not found
eval: 1: compile_command+=: not found
eval: 1: finalize_command+=: not found
eval: 1: libtool_args+=: not found
eval: 1: libobjs+=: not found
eval: 1: non_pic_objects+=: not found
eval: 1: compile_command+=: not found
eval: 1: finalize_command+=: not found
eval: 1: libtool_args+=: not found
eval: 1: libobjs+=: not found
eval: 1: non_pic_objects+=: not found
eval: 1: compile_command+=: not found
eval: 1: finalize_command+=: not found
eval: 1: libtool_args+=: not found
eval: 1: libobjs+=: not found
eval: 1: non_pic_objects+=: not found
eval: 1: compile_command+=: not found
eval: 1: finalize_command+=: not found
eval: 1: libtool_args+=: not found
eval: 1: libobjs+=: not found
eval: 1: non_pic_objects+=: not found
eval: 1: compile_command+=: not found
eval: 1: finalize_command+=: not found
eval: 1: libtool_args+=: not found
eval: 1: libobjs+=: not found
eval: 1: non_pic_objects+=: not found
eval: 1: compile_command+=: not found
eval: 1: finalize_command+=: not found
eval: 1: libtool_args+=: not found
eval: 1: libtool_args+=: not found
eval: 1: libtool_args+=: not found
eval: 1: libtool_args+=: not found
eval: 1: libtool_args+=: not found
eval: 1: libtool_args+=: not found
eval: 1: libtool_args+=: not found
libtool: link: /usr/bin/nm -B   | sed -n -e 's/^.*[    ]\([ABCDGIRSTW][ABCDGIRSTW]*\)[    ][    ]*\([_A-Za-z][_A-Za-z0-9]*\)$/\1 \2 \2/p' | /bin/sed 's/.* //' | sort | uniq > lib/.libs/libportaudio.exp
/usr/bin/nm: 'a.out': No such file
libtool: link: /bin/grep -E -e "(Pa|PaMacCore|PaJack|PaAlsa|PaAsio)_.*" "lib/.libs/libportaudio.exp" > "lib/.libs/libportaudio.expT"
libtool: link: mv -f "lib/.libs/libportaudio.expT" "lib/.libs/libportaudio.exp"
libtool: link: echo "{ global:" > lib/.libs/libportaudio.ver
libtool: link:  cat lib/.libs/libportaudio.exp | sed -e "s/\(.*\)/\1;/" >> lib/.libs/libportaudio.ver
libtool: link:  echo "local: *; };" >> lib/.libs/libportaudio.ver
libtool: link:  gcc -shared   /usr/lib/libasound.so -ldl -ljack -lrt -lm -lpthread    -Wl,-soname -Wl,libportaudio.so.2 -Wl,-version-script -Wl,lib/.libs/libportaudio.ver -o lib/.libs/libportaudio.so.2.0.0
/usr/bin/ld:lib/.libs/libportaudio.ver:2: syntax error in VERSION script
collect2: ld returned 1 exit status
make[2]: *** [lib/libportaudio.la] Error 1
make[2]: Leaving directory `/home/ka1ssr/audacity/lib-src/portaudio-v19'
make[1]: *** [portaudio-v19-recursive] Error 2
make[1]: Leaving directory `/home/ka1ssr/audacity/lib-src'
make: *** [audacity] Error 2
ka1ssr@ernie:~/audacity$


I'm building under Ubuntu 10.10, but the problem was first noticed on 10.04. I can't remember exactly when I started having problems, sorry.

Thanks for your help.
ka1ssr
 
Posts: 17
Joined: Sat Jan 12, 2008 7:15 pm

Re: Can't build svn10729

Permanent link to this post Posted by steve » Wed Oct 13, 2010 5:07 am

There is currently a problem and the developers are aware of it. The last version that builds on Ubuntu is r10709
Watch this thread for news:
http://sourceforge.net/mailarchive/foru ... city-devel
9/10 questions are answered in the FREQUENTLY ASKED QUESTIONS (FAQ)
steve
Senior Forum Staff
 
Posts: 34087
Joined: Sat Dec 01, 2007 11:43 am


Return to GNU/Linux and Unix-like



Who is online

Users browsing this forum: No registered users and 2 guests